aboutsummaryrefslogtreecommitdiffstats
path: root/crypto/openssl/crypto/err/openssl.txt
diff options
context:
space:
mode:
Diffstat (limited to 'crypto/openssl/crypto/err/openssl.txt')
-rw-r--r--crypto/openssl/crypto/err/openssl.txt5
1 files changed, 5 insertions, 0 deletions
diff --git a/crypto/openssl/crypto/err/openssl.txt b/crypto/openssl/crypto/err/openssl.txt
index 35512f9caf96..0b5873ebbcb7 100644
--- a/crypto/openssl/crypto/err/openssl.txt
+++ b/crypto/openssl/crypto/err/openssl.txt
@@ -934,6 +934,8 @@ PEM_F_PEM_READ_PRIVATEKEY:124:PEM_read_PrivateKey
PEM_F_PEM_SIGNFINAL:112:PEM_SignFinal
PEM_F_PEM_WRITE:113:PEM_write
PEM_F_PEM_WRITE_BIO:114:PEM_write_bio
+PEM_F_PEM_WRITE_BIO_PRIVATEKEY_TRADITIONAL:147:\
+ PEM_write_bio_PrivateKey_traditional
PEM_F_PEM_WRITE_PRIVATEKEY:139:PEM_write_PrivateKey
PEM_F_PEM_X509_INFO_READ:115:PEM_X509_INFO_read
PEM_F_PEM_X509_INFO_READ_BIO:116:PEM_X509_INFO_read_bio
@@ -1742,6 +1744,7 @@ X509_F_X509_NAME_PRINT:117:X509_NAME_print
X509_F_X509_OBJECT_NEW:150:X509_OBJECT_new
X509_F_X509_PRINT_EX_FP:118:X509_print_ex_fp
X509_F_X509_PUBKEY_DECODE:148:x509_pubkey_decode
+X509_F_X509_PUBKEY_GET:161:X509_PUBKEY_get
X509_F_X509_PUBKEY_GET0:119:X509_PUBKEY_get0
X509_F_X509_PUBKEY_SET:120:X509_PUBKEY_set
X509_F_X509_REQ_CHECK_PRIVATE_KEY:144:X509_REQ_check_private_key
@@ -2164,6 +2167,7 @@ EC_R_KEYS_NOT_SET:140:keys not set
EC_R_LADDER_POST_FAILURE:136:ladder post failure
EC_R_LADDER_PRE_FAILURE:153:ladder pre failure
EC_R_LADDER_STEP_FAILURE:162:ladder step failure
+EC_R_MISSING_OID:167:missing OID
EC_R_MISSING_PARAMETERS:124:missing parameters
EC_R_MISSING_PRIVATE_KEY:125:missing private key
EC_R_NEED_NEW_SETUP_VALUES:157:need new setup values
@@ -2398,6 +2402,7 @@ PEM_R_UNEXPECTED_DEK_IV:130:unexpected dek iv
PEM_R_UNSUPPORTED_CIPHER:113:unsupported cipher
PEM_R_UNSUPPORTED_ENCRYPTION:114:unsupported encryption
PEM_R_UNSUPPORTED_KEY_COMPONENTS:126:unsupported key components
+PEM_R_UNSUPPORTED_PUBLIC_KEY_TYPE:110:unsupported public key type
PKCS12_R_CANT_PACK_STRUCTURE:100:cant pack structure
PKCS12_R_CONTENT_TYPE_NOT_DATA:121:content type not data
PKCS12_R_DECODE_ERROR:101:decode error